BDBM498099 US11008338, Example 15
SMILES CC1(C)C(=N)N[C@]2(CO[C@H](C[C@H]2S1(=O)=O)c1ccc(F)cc1)c1cc(Oc2cc(ccn2)[N+]#[C-])ccc1F
InChI Key InChIKey=NFXGXCBTHKHWAP-AZSVPQILSA-N
Data  2 KI
  Tab Delimited (TSV)   2D SDfile   Computed 3D by Vconf -m prep SDfile
Find this compound or compounds like it in BindingDB:
Activity Spreadsheet -- Enzyme Inhibition Constant Data from BindingDB
Found 2 hits for monomerid = 498099
TargetBeta-secretase 1(Homo sapiens (Human))
Merck Sharp & Dohme
US Patent
LigandPNGBDBM498099(US11008338, Example 15)
Affinity DataKi:  17.9nM. Assay description: BACE1: A homogeneous time-resolved FRET assay can be used to determine IC50 values for inhibitors of the soluble human BACE1 catalytic domain. This a...
Ligand InfoPC cidPC sid
In DepthDetails US Patent
TargetBeta-secretase 2(Homo sapiens (Human))
Merck Sharp & Dohme
US Patent
LigandPNGBDBM498099(US11008338, Example 15)
Affinity DataKi:  19.8nM. Assay description: BACE2: Inhibitor IC50s at purified human autoBACE-2 are determined in a time-resolved endpoint proteolysis assay that measures hydrolysis of the QSY7...
Ligand InfoPC cidPC sid
In DepthDetails US Patent