BDBM498220 US11014911, Example 45::US11718603, Example 45
SMILES CC[C@H](C)NC(=O)O[C@@H]1CC[C@@H](C1)c1cc(NC(=O)Cc2ccc(C)cc2S(C)(=O)=O)n[nH]1
InChI Key
Data  4 KI
  Tab Delimited (TSV)   2D SDfile   Computed 3D by Vconf -m prep SDfile
Find this compound or compounds like it in BindingDB:
Activity Spreadsheet -- Enzyme Inhibition Constant Data from BindingDB
Found 4 hits for monomerid = 498220
TargetCyclin-dependent kinase 2/G1/S-specific cyclin-E1(Homo sapiens (Human))
Pfizer
US Patent
LigandPNGBDBM498220(US11014911, Example 45 | US11718603, Example 45)
Affinity DataKi:  0.110nM. Assay description: The purpose of CDK2/Cyclin E1 assay is to evaluate the inhibition (% inhibition, Kiapp and Ki values) of small molecule inhibitors by using a fluores...
Ligand InfoPC cidPC sid
In DepthDetails US Patent
TargetCyclin-dependent kinase 2/G1/S-specific cyclin-E1(Homo sapiens (Human))
Pfizer
US Patent
LigandPNGBDBM498220(US11014911, Example 45 | US11718603, Example 45)
Affinity DataKi:  0.110nM. Assay description: The purpose of CDK2/Cyclin E1 assay is to evaluate the inhibition (% inhibition, Kiapp and Ki values) of small molecule inhibitors by using a fluores...
Ligand InfoPC cidPC sid
In DepthDetails US Patent
TargetGlycogen synthase kinase-3 beta(Homo sapiens (Human))
Pfizer
US Patent
LigandPNGBDBM498220(US11014911, Example 45 | US11718603, Example 45)
Affinity DataKi:  61.4nM. Assay description: The purpose of GSK3β assay is to evaluate the inhibition (% inhibition, Kiapp and Ki values) of small molecule inhibitors by using a fluorescenc...
Ligand InfoPC cidPC sid
In DepthDetails US Patent
TargetGlycogen synthase kinase-3 beta(Homo sapiens (Human))
Pfizer
US Patent
LigandPNGBDBM498220(US11014911, Example 45 | US11718603, Example 45)
Affinity DataKi:  61.4nM. Assay description: The purpose of GSK3β assay is to evaluate the inhibition (% inhibition, Kiapp and Ki values) of small molecule inhibitors by using a fluorescenc...
Ligand InfoPC cidPC sid
In DepthDetails US Patent