BDBM498831 2-(1-Cyanopyrrolidin-3-yl)-N-(5- phenylpyrrolidin-2-yl)acetamide::US11014912, Example 7
SMILES O=C(CC1CCN(C1)C#N)NC1CCC(N1)c1ccccc1
InChI Key InChIKey=BYWMTCWRHZSJQC-UHFFFAOYSA-N
Data  1 IC50
  Tab Delimited (TSV)   2D SDfile   Computed 3D by Vconf -m prep SDfile
Find this compound or compounds like it in BindingDB:
Activity Spreadsheet -- Enzyme Inhibition Constant Data from BindingDB
Found 1 hit for monomerid = 498831
TargetUbiquitin carboxyl-terminal hydrolase 30(Homo sapiens (Human))
Mission Therapeutics
US Patent
LigandPNGBDBM498831(2-(1-Cyanopyrrolidin-3-yl)-N-(5- phenylpyrrolidin-...)
Affinity DataIC50:  550nM. Assay description: Dilution plates were prepared at 21 times the final concentration (2100 μM for a final concentration of 100 μM) in 50% DMSO in a 96-well po...
Ligand InfoPC cidPC sid
In DepthDetails US Patent