BDBM498838 2-(1- Cyanopyrrolidin-3- yl)-N-(3,4- dichlorophenyl) acetamide::US11014912, Example 14
SMILES Fc1ccc(cc1F)C1CN(C1)C(=O)CC1CCN(C1)C#N
InChI Key InChIKey=XLKWTKAHXKPHGV-UHFFFAOYSA-N
Data  1 IC50
  Tab Delimited (TSV)   2D SDfile   Computed 3D by Vconf -m prep SDfile
Find this compound or compounds like it in BindingDB:
Activity Spreadsheet -- Enzyme Inhibition Constant Data from BindingDB
Found 1 hit for monomerid = 498838
TargetUbiquitin carboxyl-terminal hydrolase 30(Homo sapiens (Human))
Mission Therapeutics
US Patent
LigandPNGBDBM498838(2-(1- Cyanopyrrolidin-3- yl)-N-(3,4- dichloropheny...)
Affinity DataIC50:  550nM. Assay description: Dilution plates were prepared at 21 times the final concentration (2100 μM for a final concentration of 100 μM) in 50% DMSO in a 96-well po...
Ligand InfoPC cidPC sid
In DepthDetails US Patent