BDBM498839 3-(2-(3-(2- Methylpyridin-4- yl)azetidin-1-yl)-2- oxoethyl)pyrrolidine- 1-carbonitrile::US11014912, Example 15
SMILES Cc1cc(ccn1)C1CN(C1)C(=O)CC1CCN(C1)C#N
InChI Key InChIKey=ZPKYHZNBILANFJ-UHFFFAOYSA-N
Data  1 IC50
  Tab Delimited (TSV)   2D SDfile   Computed 3D by Vconf -m prep SDfile
Find this compound or compounds like it in BindingDB:
Activity Spreadsheet -- Enzyme Inhibition Constant Data from BindingDB
Found 1 hit for monomerid = 498839
TargetUbiquitin carboxyl-terminal hydrolase 30(Homo sapiens (Human))
Mission Therapeutics
US Patent
LigandPNGBDBM498839(3-(2-(3-(2- Methylpyridin-4- yl)azetidin-1-yl)-2- ...)
Affinity DataIC50:  5.50E+3nM. Assay description: Dilution plates were prepared at 21 times the final concentration (2100 μM for a final concentration of 100 μM) in 50% DMSO in a 96-well po...
Ligand InfoPC cidPC sid
In DepthDetails US Patent