BDBM498854 2-(1-Cyanopyrrolidin-3- ylidene)-N-methyl-N-((5- phenyl-1H-pyrazol-3- yl)methyl)acetamide::US11014912, Example 30
SMILES CN(Cc1cc(n[nH]1)-c1ccccc1)C(=O)C=C1CCN(C1)C#N
InChI Key InChIKey=SXUXAPIBZPBPIP-ZROIWOOFSA-N
Data  1 IC50
  Tab Delimited (TSV)   2D SDfile   Computed 3D by Vconf -m prep SDfile
Find this compound or compounds like it in BindingDB:
Activity Spreadsheet -- Enzyme Inhibition Constant Data from BindingDB
Found 1 hit for monomerid = 498854
TargetUbiquitin carboxyl-terminal hydrolase 30(Homo sapiens (Human))
Mission Therapeutics
US Patent
LigandPNGBDBM498854(2-(1-Cyanopyrrolidin-3- ylidene)-N-methyl-N-((5- p...)
Affinity DataIC50:  550nM. Assay description: Dilution plates were prepared at 21 times the final concentration (2100 μM for a final concentration of 100 μM) in 50% DMSO in a 96-well po...
Ligand InfoPC cidPC sid
In DepthDetails US Patent