BDBM498893 (3S,4R)-N-[(3-chloro- 1H-indol-5-yl)methyl]- 1-(N,3-dicyclohexyl-D- alanyl)-4-{[(5-methyl- 1,3-thiazol-2- yl)carbonyl]amino}pi- peridine-3-carboxamide::US11014920, Compound 1
SMILES Cc1cnc(s1)C(=O)N[C@@H]1CCN(C[C@@H]1C(=O)NCc1ccc2[nH]cc(Cl)c2c1)C(=O)[C@@H](CC1CCCCC1)NC1CCCCC1
InChI Key
Data  1 IC50
  Tab Delimited (TSV)   2D SDfile   Computed 3D by Vconf -m prep SDfile
Find this compound or compounds like it in BindingDB:
Activity Spreadsheet -- Enzyme Inhibition Constant Data from BindingDB
Found 1 hit for monomerid = 498893
TargetCoagulation factor XII(Homo sapiens (Human))
Merck Sharp & Dohme
US Patent
LigandPNGBDBM498893((3S,4R)-N-[(3-chloro- 1H-indol-5-yl)methyl]- 1-(N,...)
Affinity DataIC50:  49.2nM. Assay description: Factor XIIa activity determinations were made in 50 mM HEPES buffer containing 150 mM NaCl, 5 mM CaCl2, and 0.1% PEG 8000 (polyethylene glycol; JT Ba...
Ligand InfoPC cidPC sid
In DepthDetails US Patent