BDBM498927 N-{(3S,4R)-1-[N~2~- cyclohexyl-N~6~- (methylsulfonyl)-N~6~- (2,2,2-trifluoroethyl)-D- lysyl]-3-[(thiophen-2- ylmethyl)carbamoyl]pi- peridin-4-yl}-6- azaspiro[2.5]octane-6- carboxamide::US11014920, Compound 35
SMILES CS(=O)(=O)N(CCCC[C@@H](NC1CCCCC1)C(=O)N1CC[C@@H](NC(=O)N2CCC3(CC3)CC2)[C@H](C1)C(=O)NCc1cccs1)CC(F)(F)F
InChI Key InChIKey=RSUKODPGJIIOTC-ZGIBFIJWSA-N
Data  1 IC50
  Tab Delimited (TSV)   2D SDfile   Computed 3D by Vconf -m prep SDfile
Find this compound or compounds like it in BindingDB:
Activity Spreadsheet -- Enzyme Inhibition Constant Data from BindingDB
Found 1 hit for monomerid = 498927
TargetCoagulation factor XII(Homo sapiens (Human))
Merck Sharp & Dohme
US Patent
LigandPNGBDBM498927(N-{(3S,4R)-1-[N~2~- cyclohexyl-N~6~- (methylsulfon...)
Affinity DataIC50:  19.5nM. Assay description: Factor XIIa activity determinations were made in 50 mM HEPES buffer containing 150 mM NaCl, 5 mM CaCl2, and 0.1% PEG 8000 (polyethylene glycol; JT Ba...
Ligand InfoPC cidPC sid
In DepthDetails US Patent