BDBM498936 US11014926, Cpd. No. 7
SMILES Cc1ncnc2n(ccc12)-c1ccc2C(=O)NCc2c1
InChI Key InChIKey=VWSCNSQCEYPHHL-UHFFFAOYSA-N
Data  1 IC50
  Tab Delimited (TSV)   2D SDfile   Computed 3D by Vconf -m prep SDfile
Find this compound or compounds like it in BindingDB:
Activity Spreadsheet -- Enzyme Inhibition Constant Data from BindingDB
Found 1 hit for monomerid = 498936
TargetMAP kinase-interacting serine/threonine-protein kinase 2(Homo sapiens (Human))
Effector Therapeutics
US Patent
LigandPNGBDBM498936(US11014926, Cpd. No. 7)
Affinity DataIC50:  5.05E+3nM. Assay description: Compounds are screened for MNK inhibition using the ADP-Glo kinase assay kit (Promega, catalogue No. V9101). All kinase reactions are performed in Re...
Ligand InfoPC cidPC sid
In DepthDetails US Patent