BDBM498939 US11014926, Cpd. No. 10
SMILES O=C1NCc2cc(ccc12)-c1nccc2C(=O)NCc12
InChI Key InChIKey=BFXRXRZGYGDGSA-UHFFFAOYSA-N
Data  1 IC50
  Tab Delimited (TSV)   2D SDfile   Computed 3D by Vconf -m prep SDfile
Find this compound or compounds like it in BindingDB:
Activity Spreadsheet -- Enzyme Inhibition Constant Data from BindingDB
Found 1 hit for monomerid = 498939
TargetMAP kinase-interacting serine/threonine-protein kinase 2(Homo sapiens (Human))
Effector Therapeutics
US Patent
LigandPNGBDBM498939(US11014926, Cpd. No. 10)
Affinity DataIC50: >5.70E+4nM. Assay description: Compounds are screened for MNK inhibition using the ADP-Glo kinase assay kit (Promega, catalogue No. V9101). All kinase reactions are performed in Re...
Ligand InfoPC cidPC sid
In DepthDetails US Patent