BDBM499027 US11014929, Example 65::US11542265, Example 65
SMILES CNCc1cc(F)c(c(F)c1)-c1ncc2[nH]nc(-c3ccc(cc3)C3CCNCC3)c2n1
InChI Key InChIKey=ZNDPVJWFHCKKBW-UHFFFAOYSA-N
Data  2 KI
  Tab Delimited (TSV)   2D SDfile   Computed 3D by Vconf -m prep SDfile
Find this compound or compounds like it in BindingDB:
Activity Spreadsheet -- Enzyme Inhibition Constant Data from BindingDB
Found 2 hits for monomerid = 499027
TargetMitogen-activated protein kinase kinase kinase kinase 1(Homo sapiens (Human))
Incyte
US Patent
LigandPNGBDBM499027(US11014929, Example 65 | US11542265, Example 65)
Affinity DataKi: <50nM. Assay description: A stock solution of 1 mM test compound was prepared in DMSO. The compound plate was prepared by 3-fold and 11-point serial dilutions. 0.1 μL of ...
Ligand InfoPC cidPC sid
In DepthDetails US Patent
TargetMitogen-activated protein kinase kinase kinase kinase 1(Homo sapiens (Human))
Incyte
US Patent
LigandPNGBDBM499027(US11014929, Example 65 | US11542265, Example 65)
Affinity DataKi: <100nM. Assay description: A stock solution of 1 mM test compound was prepared in DMSO. The compound plate was prepared by 3-fold and 11-point serial dilutions. 0.1 μL of ...
Ligand InfoPC cidPC sid
In DepthDetails US Patent