BDBM499156 US11014930, Example 79
SMILES Cc1cc(NC(=O)c2c(C#CC(C)(C)O)n(c3ncnc(N)c23)C2(C)CC2)n[nH]1
InChI Key InChIKey=BAQZVMZHRWELTR-UHFFFAOYSA-N
Data  1 IC50
  Tab Delimited (TSV)   2D SDfile   Computed 3D by Vconf -m prep SDfile
Find this compound or compounds like it in BindingDB:
Activity Spreadsheet -- Enzyme Inhibition Constant Data from BindingDB
Found 1 hit for monomerid = 499156
TargetProto-oncogene tyrosine-protein kinase receptor Ret(Homo sapiens (Human))
Taiho Pharmaceutical
US Patent
LigandPNGBDBM499156(US11014930, Example 79)
Affinity DataIC50:  0.0700nM. Assay description: To measure the inhibitory activity, first, the compounds of the present invention were individually diluted with dimethyl sulfoxide (DMSO) stepwise. ...
Ligand InfoPC cidPC sid
In DepthDetails US Patent