BDBM499157 US11014930, Example 80
SMILES Cc1cc(NC(=O)c2c(C#Cc3cccnc3)n(c3ncnc(N)c23)C2(C)CC2)n[nH]1
InChI Key InChIKey=WJOMVKXZFSMUMB-UHFFFAOYSA-N
Data  1 IC50
  Tab Delimited (TSV)   2D SDfile   Computed 3D by Vconf -m prep SDfile
Find this compound or compounds like it in BindingDB:
Activity Spreadsheet -- Enzyme Inhibition Constant Data from BindingDB
Found 1 hit for monomerid = 499157
TargetProto-oncogene tyrosine-protein kinase receptor Ret(Homo sapiens (Human))
Taiho Pharmaceutical
US Patent
LigandPNGBDBM499157(US11014930, Example 80)
Affinity DataIC50:  0.0900nM. Assay description: To measure the inhibitory activity, first, the compounds of the present invention were individually diluted with dimethyl sulfoxide (DMSO) stepwise. ...
Ligand InfoPC cidPC sid
In DepthDetails US Patent