BDBM499199 US11014963, Example 98
SMILES COc1ccc(cc1)[C@H](NC(=O)[C@H](Cc1cccc(Cl)c1)NC(=O)c1ccc(CN)c(Cl)c1)C(=O)N[C@@H](C(C)C)C(=O)C(F)(F)F
InChI Key InChIKey=KJIZCHCIGKMOHD-QKDODKLFSA-N
Data  1 IC50
  Tab Delimited (TSV)   2D SDfile   Computed 3D by Vconf -m prep SDfile
Find this compound or compounds like it in BindingDB:
Activity Spreadsheet -- Enzyme Inhibition Constant Data from BindingDB
Found 1 hit for monomerid = 499199
TargetSerine protease HTRA1(Homo sapiens (Human))
Hoffmann-La Roche
US Patent
LigandPNGBDBM499199(US11014963, Example 98)
Affinity DataIC50:  1.5nM. Assay description: Enzyme activity is measured by observing the increase in fluorescence intensity caused by cleavage of a peptide substrate containing a fluorophore, w...
Ligand InfoPC cidPC sid
In DepthDetails US Patent