BDBM499321 US11020381, Example 11::tert-butyl 4-(((5-(3-((4- ((methylsulfonyl)carbamoyl) benzyl)oxy)phenyl)pyridin-2- yl)oxy)methyl)piperidine-1- carboxylate
SMILES CC(C)(C)OC(=O)N1CCC(COc2ccc(cn2)-c2cccc(OCc3ccc(cc3)C(=O)NS(C)(=O)=O)c2)CC1
InChI Key InChIKey=QNWKXTXARJFFPM-UHFFFAOYSA-N
Data  1 IC50
  Tab Delimited (TSV)   2D SDfile   Computed 3D by Vconf -m prep SDfile
Find this compound or compounds like it in BindingDB:
Activity Spreadsheet -- Enzyme Inhibition Constant Data from BindingDB
Found 1 hit for monomerid = 499321
TargetSodium channel protein type 9 subunit alpha(Homo sapiens (Human))
Raqualia Pharma
US Patent
LigandPNGBDBM499321(US11020381, Example 11 | tert-butyl 4-(((5-(3-((4-...)
Affinity DataIC50: <500nM. Assay description: This screen is used to determine the effects of compounds on human Nav1.7 channels, utilizing electrical field stimulation (EFS) system in 96-well pl...
Ligand InfoPC cidPC sid
In DepthDetails US Patent