BDBM499346 4-((3-(6- (cyclopropylmethoxy)pyridin-3- yl)-5-methylphenoxy)methyl)-N- (cyclopropylsulfonyl)-3- fluorobenzamide::US11020381, Example 36
SMILES Cc1cc(OCc2ccc(cc2F)C(=O)NS(=O)(=O)C2CC2)cc(c1)-c1ccc(OCC2CC2)nc1
InChI Key InChIKey=FKHJXDYHXBABCA-UHFFFAOYSA-N
Data  1 IC50
  Tab Delimited (TSV)   2D SDfile   Computed 3D by Vconf -m prep SDfile
Find this compound or compounds like it in BindingDB:
Activity Spreadsheet -- Enzyme Inhibition Constant Data from BindingDB
Found 1 hit for monomerid = 499346
TargetSodium channel protein type 9 subunit alpha(Homo sapiens (Human))
Raqualia Pharma
US Patent
LigandPNGBDBM499346(4-((3-(6- (cyclopropylmethoxy)pyridin-3- yl)-5-met...)
Affinity DataIC50: <500nM. Assay description: This screen is used to determine the effects of compounds on human Nav1.7 channels, utilizing electrical field stimulation (EFS) system in 96-well pl...
Ligand InfoPC cidPC sid
In DepthDetails US Patent