BDBM499375 4-((3-(3-chloro-5- (cyclopropylmethoxy)pyridin-2- yl)phenoxy)methyl)-N- (methylsulfonyl)benzamide::US11020381, Example 69
SMILES CS(=O)(=O)NC(=O)c1ccc(COc2cccc(c2)-c2ncc(OCC3CC3)cc2Cl)cc1
InChI Key InChIKey=XBFSFFBDWRUUTJ-UHFFFAOYSA-N
Data  1 IC50
  Tab Delimited (TSV)   2D SDfile   Computed 3D by Vconf -m prep SDfile
Find this compound or compounds like it in BindingDB:
Activity Spreadsheet -- Enzyme Inhibition Constant Data from BindingDB
Found 1 hit for monomerid = 499375
TargetSodium channel protein type 9 subunit alpha(Homo sapiens (Human))
Raqualia Pharma
US Patent
LigandPNGBDBM499375(4-((3-(3-chloro-5- (cyclopropylmethoxy)pyridin-2- ...)
Affinity DataIC50: <500nM. Assay description: This screen is used to determine the effects of compounds on human Nav1.7 channels, utilizing electrical field stimulation (EFS) system in 96-well pl...
Ligand InfoPC cidPC sid
In DepthDetails US Patent