BDBM499424 4-((3-(5-(cyclopropylmethoxy)-3- methylpyridin-2- yl)phenoxy)methyl)-3-fluoro-N- (methylsulfonyl)benzamide::US11020381, Example 120
SMILES Cc1cc(OCC2CC2)cnc1-c1cccc(OCc2ccc(cc2F)C(=O)NS(C)(=O)=O)c1
InChI Key InChIKey=CDJWWOBHOVWZHJ-UHFFFAOYSA-N
Data  1 IC50
  Tab Delimited (TSV)   2D SDfile   Computed 3D by Vconf -m prep SDfile
Find this compound or compounds like it in BindingDB:
Activity Spreadsheet -- Enzyme Inhibition Constant Data from BindingDB
Found 1 hit for monomerid = 499424
TargetSodium channel protein type 9 subunit alpha(Homo sapiens (Human))
Raqualia Pharma
US Patent
LigandPNGBDBM499424(4-((3-(5-(cyclopropylmethoxy)-3- methylpyridin-2- ...)
Affinity DataIC50: <500nM. Assay description: This screen is used to determine the effects of compounds on human Nav1.7 channels, utilizing electrical field stimulation (EFS) system in 96-well pl...
Ligand InfoPC cidPC sid
In DepthDetails US Patent