BDBM499439 4-((3-(2-(cyclopropylmethoxy)-3- methylpyridin-4-yl)-4- fluorophenoxy)methyl)- 3-fluoro-N- (methylsulfonyl)benzamide::US11020381, Example 135
SMILES Cc1c(OCC2CC2)nccc1-c1cc(OCc2ccc(cc2F)C(=O)NS(C)(=O)=O)ccc1F
InChI Key InChIKey=NXTPKFAMLKGFAO-UHFFFAOYSA-N
Data  1 IC50
  Tab Delimited (TSV)   2D SDfile   Computed 3D by Vconf -m prep SDfile
Find this compound or compounds like it in BindingDB:
Activity Spreadsheet -- Enzyme Inhibition Constant Data from BindingDB
Found 1 hit for monomerid = 499439
TargetSodium channel protein type 9 subunit alpha(Homo sapiens (Human))
Raqualia Pharma
US Patent
LigandPNGBDBM499439(4-((3-(2-(cyclopropylmethoxy)-3- methylpyridin-4-y...)
Affinity DataIC50: <500nM. Assay description: This screen is used to determine the effects of compounds on human Nav1.7 channels, utilizing electrical field stimulation (EFS) system in 96-well pl...
Ligand InfoPC cidPC sid
In DepthDetails US Patent