BDBM499463 5-(cyclopropylmethoxy)- 3'-fluoro- 5'-((2-fluoro-4- ((methylsulfonyl) carbamoyl)benzyl) oxy)-N,N-dimethyl- [1,1'-biphenyl]-3- carboxamide::US11020381, Example 163
SMILES CN(C)C(=O)c1cc(OCC2CC2)cc(c1)-c1cc(F)cc(OCc2ccc(cc2F)C(=O)NS(C)(=O)=O)c1
InChI Key InChIKey=OCGCJMLHKISFEG-UHFFFAOYSA-N
Data  1 IC50
  Tab Delimited (TSV)   2D SDfile   Computed 3D by Vconf -m prep SDfile
Find this compound or compounds like it in BindingDB:
Activity Spreadsheet -- Enzyme Inhibition Constant Data from BindingDB
Found 1 hit for monomerid = 499463
TargetSodium channel protein type 9 subunit alpha(Homo sapiens (Human))
Raqualia Pharma
US Patent
LigandPNGBDBM499463(5-(cyclopropylmethoxy)- 3'-fluoro- 5'-((2-fluoro-4...)
Affinity DataIC50: <500nM. Assay description: This screen is used to determine the effects of compounds on human Nav1.7 channels, utilizing electrical field stimulation (EFS) system in 96-well pl...
Ligand InfoPC cidPC sid
In DepthDetails US Patent