BDBM499476 US11020381, WO2012/007868 comparative compound Example 106
SMILES CN1CCC(CC1)c1cccc(OCc2cc(F)c(cc2F)C(=O)NS(C)(=O)=O)c1
InChI Key InChIKey=LRKVAZLKHSWBFF-UHFFFAOYSA-N
Data  1 IC50
  Tab Delimited (TSV)   2D SDfile   Computed 3D by Vconf -m prep SDfile
Find this compound or compounds like it in BindingDB:
Activity Spreadsheet -- Enzyme Inhibition Constant Data from BindingDB
Found 1 hit for monomerid = 499476
TargetSodium channel protein type 9 subunit alpha(Homo sapiens (Human))
Raqualia Pharma
US Patent
LigandPNGBDBM499476(US11020381, WO2012/007868 comparative compound Exa...)
Affinity DataIC50:  9.20E+3nM
Ligand InfoPC cidPC sid
In DepthDetails US Patent