BDBM499485 US11020395, Example 7.0
SMILES CO[C@@H]([C@H](C)S(=O)(=O)Nc1nnc(C2CCC2)n1-c1c(OC)ncnc1OC)c1ncc(Cl)cn1
InChI Key InChIKey=MDIJDYHATCPVPM-NHYWBVRUSA-N
Data  1 EC50
  Tab Delimited (TSV)   2D SDfile   Computed 3D by Vconf -m prep SDfile
Find this compound or compounds like it in BindingDB:
Activity Spreadsheet -- Enzyme Inhibition Constant Data from BindingDB
Found 1 hit for monomerid = 499485
TargetApelin receptor(Homo sapiens (Human))
Amgen
US Patent
LigandPNGBDBM499485(US11020395, Example 7.0)
Affinity DataEC50:  66nM. Assay description: The human APJ receptor was cloned by polymerase chain reaction and the gene encoding the receptor was subcloned in pFLAG-CMV™-3 expression vector (Si...
Ligand InfoPC cidPC sid
In DepthDetails US Patent