BDBM499536 US11020395, Example 132.0::US11020395, Example 133.0
SMILES COCC1(CC1)n1c(NS(=O)(=O)[C@@H](C)[C@H](OC)c2ncc(Cl)cn2)nnc1[C@H]1C[C@H](CO)C1
InChI Key InChIKey=YXCNKFSTTTVXEL-YXWQFLTLSA-N
Data  2 EC50
  Tab Delimited (TSV)   2D SDfile   Computed 3D by Vconf -m prep SDfile
Find this compound or compounds like it in BindingDB:
Activity Spreadsheet -- Enzyme Inhibition Constant Data from BindingDB
Found 2 hits for monomerid = 499536
TargetApelin receptor(Homo sapiens (Human))
Amgen
US Patent
LigandPNGBDBM499536(US11020395, Example 132.0 | US11020395, Example 13...)
Affinity DataEC50:  120nM. Assay description: The human APJ receptor was cloned by polymerase chain reaction and the gene encoding the receptor was subcloned in pFLAG-CMV™-3 expression vector (Si...
Ligand InfoPC cidPC sid
In DepthDetails US Patent
TargetApelin receptor(Homo sapiens (Human))
Amgen
US Patent
LigandPNGBDBM499536(US11020395, Example 132.0 | US11020395, Example 13...)
Affinity DataEC50:  1.27E+3nM. Assay description: The human APJ receptor was cloned by polymerase chain reaction and the gene encoding the receptor was subcloned in pFLAG-CMV™-3 expression vector (Si...
Ligand InfoPC cidPC sid
In DepthDetails US Patent