BDBM499600 US11020395, Example 196.0::US11020395, Example 197.0
SMILES CO[C@@H]([C@H](C)S(=O)(=O)Nc1nnc([C@H]2CC(=O)C2(C)C)n1-c1c(OC)cccc1OC)c1ncc(Cl)cn1
InChI Key InChIKey=OCTXTCKJMGIEDE-AGKSTNPPSA-N
Data  2 EC50
  Tab Delimited (TSV)   2D SDfile   Computed 3D by Vconf -m prep SDfile
Find this compound or compounds like it in BindingDB:
Activity Spreadsheet -- Enzyme Inhibition Constant Data from BindingDB
Found 2 hits for monomerid = 499600
TargetApelin receptor(Homo sapiens (Human))
Amgen
US Patent
LigandPNGBDBM499600(US11020395, Example 196.0 | US11020395, Example 19...)
Affinity DataEC50:  870nM. Assay description: The human APJ receptor was cloned by polymerase chain reaction and the gene encoding the receptor was subcloned in pFLAG-CMV™-3 expression vector (Si...
Ligand InfoPC cidPC sid
In DepthDetails US Patent
TargetApelin receptor(Homo sapiens (Human))
Amgen
US Patent
LigandPNGBDBM499600(US11020395, Example 196.0 | US11020395, Example 19...)
Affinity DataEC50:  330nM. Assay description: The human APJ receptor was cloned by polymerase chain reaction and the gene encoding the receptor was subcloned in pFLAG-CMV™-3 expression vector (Si...
Ligand InfoPC cidPC sid
In DepthDetails US Patent