BDBM499653 US11020397, Compound Formula-(IIm)
SMILES CSc1nc(O)c(C(=O)Nc2cccc(c2)-c2c[nH]nn2)c(=O)[nH]1
InChI Key InChIKey=WGNZFDQBTVVYMZ-UHFFFAOYSA-N
Data  1 IC50
  Tab Delimited (TSV)   2D SDfile   Computed 3D by Vconf -m prep SDfile
Find this compound or compounds like it in BindingDB:
Activity Spreadsheet -- Enzyme Inhibition Constant Data from BindingDB
Found 1 hit for monomerid = 499653
TargetXanthine dehydrogenase/oxidase(Homo sapiens (Human))
Acquist
US Patent
LigandPNGBDBM499653(US11020397, Compound Formula-(IIm))
Affinity DataIC50:  8.64nM. Assay description: Xanthine oxidase inhibition was determined using a standard fluorescence-based assay for xanthine oxidase activity (McHale A, Grimes H, Coughlan M P:...
Ligand InfoPC cidPC sid
In DepthDetails US Patent