BDBM499680 US11020397, Compound Formula-(II4)
SMILES CSc1nc(O)c(C(=O)Nc2ccc(cc2OC(F)F)-c2c[nH]nn2)c(=O)[nH]1
InChI Key InChIKey=SGQPVFMQOQNLQE-UHFFFAOYSA-N
Data  2 IC50
  Tab Delimited (TSV)   2D SDfile   Computed 3D by Vconf -m prep SDfile
Find this compound or compounds like it in BindingDB:
Activity Spreadsheet -- Enzyme Inhibition Constant Data from BindingDB
Found 2 hits for monomerid = 499680
TargetXanthine dehydrogenase/oxidase(Homo sapiens (Human))
Acquist
US Patent
LigandPNGBDBM499680(US11020397, Compound Formula-(II4))
Affinity DataIC50:  0.0600nM. Assay description: Xanthine oxidase inhibition was determined using a standard fluorescence-based assay for xanthine oxidase activity (McHale A, Grimes H, Coughlan M P:...
Ligand InfoPC cidPC sid
In DepthDetails US Patent
TargetSolute carrier family 22 member 12(Homo sapiens (Human))
Acquist
US Patent
LigandPNGBDBM499680(US11020397, Compound Formula-(II4))
Affinity DataIC50:  2.30E+3nM. Assay description: URAT1 (SLC22A12) activity was evaluated in a cellular uptake assay using a 96-well plate with stably transfected URAT-1/CHO cells. 3H-orotate was use...
Ligand InfoPC cidPC sid
In DepthDetails US Patent