BDBM499731 (2-chlorophenyl)(4-((cis-4- (methylamino)cyclohexyl)amino)-7H- pyrrolo[2,3-d]pyrimidin-5-yl)methanone::US11020398, Compound I-43
SMILES CN[C@H]1CC[C@H](CC1)Nc1ncnc2[nH]cc(C(=O)c3ccccc3Cl)c12
InChI Key
Data  1 IC50
  Tab Delimited (TSV)   2D SDfile   Computed 3D by Vconf -m prep SDfile
Find this compound or compounds like it in BindingDB:
Activity Spreadsheet -- Enzyme Inhibition Constant Data from BindingDB
Found 1 hit for monomerid = 499731
TargetTyrosine-protein kinase BTK(Homo sapiens (Human))
Arqule
US Patent
LigandPNGBDBM499731((2-chlorophenyl)(4-((cis-4- (methylamino)cyclohexy...)
Affinity DataIC50:  2.10nM. Assay description: Full length unphosphorylated form of BTK expressed in Sf9 cells was employed to test inhibitory activity in the inactive BTK assay. The assay was mea...
Ligand InfoPC cidPC sid
In DepthDetails US Patent