BDBM499871 (2-chloro-4-(3- chlorophenoxy)phenyl)(4-(((3R,6S)-6- ((R)-1-hydroxyethyl)tetrahydro-2H- pyran-3-yl)amino)-7H-pyrrolo[2,3- d]pyrimidin-5-yl)methanone::US11020398, Compound I-183
SMILES C[C@@H](O)[C@@H]1CC[C@H](CO1)Nc1ncnc2[nH]cc(C(=O)c3ccc(Oc4cccc(Cl)c4)cc3Cl)c12
InChI Key
Data  1 IC50
  Tab Delimited (TSV)   2D SDfile   Computed 3D by Vconf -m prep SDfile
Find this compound or compounds like it in BindingDB:
Activity Spreadsheet -- Enzyme Inhibition Constant Data from BindingDB
Found 1 hit for monomerid = 499871
TargetTyrosine-protein kinase BTK(Homo sapiens (Human))
Arqule
US Patent
LigandPNGBDBM499871((2-chloro-4-(3- chlorophenoxy)phenyl)(4-(((3R,6S)-...)
Affinity DataIC50:  2.20nM. Assay description: The active BTK assay consisted of phosphorylated form of full length BTK. The assay was performed in a buffer solution utilized in the inactive BTK a...
Ligand InfoPC cidPC sid
In DepthDetails US Patent