BDBM499889 (2-chloro-4-phenoxyphenyl)(4-((trans- 4-hydroxy-4-methylcyclohexyl)amino)- 7H-pyrrolo[2,3-d]pyrimidin-5- yl)methanone::US11020398, Compound I-201
SMILES C[C@]1(O)CC[C@@H](CC1)Nc1ncnc2[nH]cc(C(=O)c3ccc(Oc4ccccc4)cc3Cl)c12
InChI Key
Data  1 IC50
  Tab Delimited (TSV)   2D SDfile   Computed 3D by Vconf -m prep SDfile
Find this compound or compounds like it in BindingDB:
Activity Spreadsheet -- Enzyme Inhibition Constant Data from BindingDB
Found 1 hit for monomerid = 499889
TargetTyrosine-protein kinase BTK(Homo sapiens (Human))
Arqule
US Patent
LigandPNGBDBM499889((2-chloro-4-phenoxyphenyl)(4-((trans- 4-hydroxy-4-...)
Affinity DataIC50:  1.5nM. Assay description: The active BTK assay consisted of phosphorylated form of full length BTK. The assay was performed in a buffer solution utilized in the inactive BTK a...
Ligand InfoPC cidPC sid
In DepthDetails US Patent