BDBM50000065 CHEMBL141501::[2-(3,4-Dichloro-phenyl)-ethyl]-ethyl-(2-pyrrolidin-1-yl-ethyl)-amine
SMILES CCN(CCN1CCCC1)CCc1ccc(Cl)c(Cl)c1
InChI Key InChIKey=NMEAEGORKFOIDR-UHFFFAOYSA-N
Data  2 KI
  Tab Delimited (TSV)   2D SDfile   Computed 3D by Vconf -m prep SDfile
Find this compound or compounds like it in BindingDB:
Activity Spreadsheet -- Enzyme Inhibition Constant Data from BindingDB
Found 2 hits for monomerid = 50000065
TargetSigma non-opioid intracellular receptor 1(Homo sapiens (Human))
National Institute Of Diabetes And Digestive And Kidney Diseases
Curated by ChEMBL
LigandPNGBDBM50000065(CHEMBL141501 | [2-(3,4-Dichloro-phenyl)-ethyl]-eth...)
Affinity DataKi:  0.510nM. Assay description: Displacement of [3H]-(+) -3PPP from sigma receptor in guinea pig brain membranes
In DepthDetails ArticlePubMed
TargetD(2) dopamine receptor(Rattus norvegicus (rat))
National Institute Of Diabetes And Digestive And Kidney Diseases
Curated by ChEMBL
LigandPNGBDBM50000065(CHEMBL141501 | [2-(3,4-Dichloro-phenyl)-ethyl]-eth...)
Affinity DataKi:  1.67E+3nM. Assay description: Ability of the compound to displace [3H]-sulpiride from dopamine receptor D2 in rat brain
In DepthDetails ArticlePubMed