BDBM50000153 CHEMBL386066::Ribonucleotide reductase inhibiting peptide analogue
SMILES CC[C@@H](C)[C@H](NC(=O)[C@@H](NC(=O)[C@@H](NC(=O)CNC(=O)[C@H](CO)NC(=O)[C@H](Cc1ccc(O)cc1)NC(C)=O)[C@@H](C)O)C(C)C)C(=O)N[C@@H](CC(N)=O)C(=O)N[C@@H](CC(O)=O)C(=O)N[C@@H](CC(C)C)C(O)=O
InChI Key InChIKey=RMKXGWJNOUJPHV-AOFRSIEYSA-N
Data  1 IC50
  Tab Delimited (TSV)   2D SDfile   Computed 3D by Vconf -m prep SDfile
Find this compound or compounds like it in BindingDB:
Activity Spreadsheet -- Enzyme Inhibition Constant Data from BindingDB
Found 1 hit for monomerid = 50000153
TargetRibonucleoside-diphosphate reductase large subunit(Homo sapiens (Human))
Notre-Dame Hospital Research
Curated by ChEMBL
LigandPNGBDBM50000153(CHEMBL386066 | Ribonucleotide reductase inhibiting...)
Affinity DataIC50:  2.20E+3nM. Assay description: Inhibitory concentaration against HSV-1 ribonucleotide reductase R1 protein binding
In DepthDetails ArticlePubMed