BDBM50000203 CHEMBL342324
SMILES Cc1cccc(n1)-c1ccccc1OCC1=NCCN1
InChI Key InChIKey=GLMXXNANUJWHRB-UHFFFAOYSA-N
Data  3 EC50
  Tab Delimited (TSV)   2D SDfile   Computed 3D by Vconf -m prep SDfile
Find this compound or compounds like it in BindingDB:
Activity Spreadsheet -- Enzyme Inhibition Constant Data from BindingDB
Found 3 hits for monomerid = 50000203
TargetAlpha-1B adrenergic receptor(Homo sapiens (Human))
Glaxosmithkline
Curated by ChEMBL
LigandPNGBDBM50000203(CHEMBL342324)
Affinity DataEC50: <1.00E+5nM. Assay description: Activation of recombinant human adrenergic, alpha-1B receptor expressed in rat-1 fibroblasts determined via calcium mobilization through Gq coupled P...Checked by Author
In DepthDetails ArticlePubMed
TargetAlpha-1D adrenergic receptor(Homo sapiens (Human))
Glaxosmithkline
Curated by ChEMBL
LigandPNGBDBM50000203(CHEMBL342324)
Affinity DataEC50: <1.00E+5nM. Assay description: Activation of recombinant human adrenergic, alpha-1D receptor expressed in rat-1 fibroblasts assayed via calcium mobilization through Gq coupled PLC ...Checked by Author
In DepthDetails ArticlePubMed
TargetAlpha-1A adrenergic receptor(Homo sapiens (Human))
Glaxosmithkline
Curated by ChEMBL
LigandPNGBDBM50000203(CHEMBL342324)
Affinity DataEC50:  126nM. Assay description: Activation of recombinant human adrenergic,alpha-1A receptor expressed in rat-1 fibroblasts determined via calcium mobilization through Gq coupled PL...Checked by Author
In DepthDetails ArticlePubMed