BDBM50000238 CHEMBL336305
SMILES FC(F)(F)c1cc(COCC(N2CCNCC2)c2cccc(C=C)c2C=C)cc(c1)C(F)(F)F
InChI Key InChIKey=PDKAKBKHMCQDHQ-UHFFFAOYSA-N
Data  1 KI
  Tab Delimited (TSV)   2D SDfile   Computed 3D by Vconf -m prep SDfile
Find this compound or compounds like it in BindingDB:
Activity Spreadsheet -- Enzyme Inhibition Constant Data from BindingDB
Found 1 hit for monomerid = 50000238
TargetSubstance-P receptor(Homo sapiens (Human))
Ucb Pharma
Curated by ChEMBL
LigandPNGBDBM50000238(CHEMBL336305)
Affinity DataKi:  1.60nM. Assay description: Displacement of [3H]-substance P from human NK1 receptor expressed in CHO cellsChecked by Author
In DepthDetails ArticlePubMed