BDBM50000254 CHEMBL136213
SMILES Brc1cc(Br)cc(COCC(N2CCNCC2)c2ccccc2)c1
InChI Key InChIKey=PYALTOQQRPEMLM-UHFFFAOYSA-N
Data  1 KI
  Tab Delimited (TSV)   2D SDfile   Computed 3D by Vconf -m prep SDfile
Find this compound or compounds like it in BindingDB:
Activity Spreadsheet -- Enzyme Inhibition Constant Data from BindingDB
Found 1 hit for monomerid = 50000254
TargetSubstance-P receptor(Homo sapiens (Human))
Ucb Pharma
Curated by ChEMBL
LigandPNGBDBM50000254(CHEMBL136213)
Affinity DataKi:  5nM. Assay description: Displacement of [3H]-substance P from human NK1 receptor expressed in CHO cellsChecked by Author
In DepthDetails ArticlePubMed