BDBM50000358 Acetic acid 7-chloro-1-(2-dimethylamino-ethyl)-4-(3-methoxy-phenyl)-2-oxo-2,3,4,5-tetrahydro-1H-benzo[b]azepin-3-yl ester::CHEMBL354353
SMILES COc1cccc(c1)[C@@H]1Cc2cc(Cl)ccc2N(CCN(C)C)C(=O)[C@@H]1OC(C)=O
InChI Key InChIKey=NBEZWPLKNBMAIM-RBBKRZOGSA-N
Data  1 Kd
  Tab Delimited (TSV)   2D SDfile   Computed 3D by Vconf -m prep SDfile
Find this compound or compounds like it in BindingDB:
Activity Spreadsheet -- Enzyme Inhibition Constant Data from BindingDB
Found 1 hit for monomerid = 50000358
TargetVoltage-dependent L-type calcium channel subunit alpha-1S(Homo sapiens (Human))
Bristol-Myers Squibb Pharmaceutical Research Institute
Curated by ChEMBL
LigandPNGBDBM50000358(Acetic acid 7-chloro-1-(2-dimethylamino-ethyl)-4-(...)
Affinity DataKd:  3.50E+3nM. Assay description: In vitro ability to displace the specific binding of [3H]-diltiazem to diltiazem receptor in guinea pig skeletal muscle.
In DepthDetails ArticlePubMed