BDBM50000412 CHEMBL157073
SMILES CCCc1ccccc1-c1nc2c([nH]1)n(CCC)c(=O)n(CCC)c2=O
InChI Key InChIKey=IYKFAALPORVMQX-UHFFFAOYSA-N
Data  2 KI
  Tab Delimited (TSV)   2D SDfile   Computed 3D by Vconf -m prep SDfile
Find this compound or compounds like it in BindingDB:
Activity Spreadsheet -- Enzyme Inhibition Constant Data from BindingDB
Found 2 hits for monomerid = 50000412
TargetAdenosine receptor A1(Rattus norvegicus (rat))
Center For Bio-Pharmaceutical Sciences
Curated by ChEMBL
LigandPNGBDBM50000412(CHEMBL157073)
Affinity DataKi:  60nM. Assay description: Evaluated for binding affinity against Adenosine A1 receptorChecked by Author
In DepthDetails ArticlePubMed
TargetAdenosine receptor A1(Rattus norvegicus (rat))
Center For Bio-Pharmaceutical Sciences
Curated by ChEMBL
LigandPNGBDBM50000412(CHEMBL157073)
Affinity DataKi:  60nM. Assay description: Evaluated for binding affinity against Adenosine A1 receptorChecked by Author
In DepthDetails ArticlePubMed