BDBM50000433 5-(2-Methoxy-phenylcarbamoyl)-pyridine-2-carboxylic acid; Hydrate::CHEMBL165533
SMILES COc1ccccc1NC(=O)c1ccc(nc1)C(O)=O
InChI Key InChIKey=WSXGAKBNKNJQNM-UHFFFAOYSA-N
Data  1 IC50
  Tab Delimited (TSV)   2D SDfile   Computed 3D by Vconf -m prep SDfile
Find this compound or compounds like it in BindingDB:
Activity Spreadsheet -- Enzyme Inhibition Constant Data from BindingDB
Found 1 hit for monomerid = 50000433
TargetTransmembrane prolyl 4-hydroxylase(Homo sapiens (Human))
Ici Pharmaceuticals Group
Curated by ChEMBL
LigandPNGBDBM50000433(5-(2-Methoxy-phenylcarbamoyl)-pyridine-2-carboxyli...)
Affinity DataIC50:  1.48E+4nM. Assay description: Inhibition of prolyl 4-hydroxylase activity by an indirect assay
In DepthDetails ArticlePubMed