BDBM50000457 CHEMBL542904
SMILES Cl.CCc1cccc2C(=O)N(CCc12)C1CN2CCC1CC2
InChI Key InChIKey=ZJFANWDAEQTGJT-UHFFFAOYSA-N
Data  1 KI
  Tab Delimited (TSV)   2D SDfile   Computed 3D by Vconf -m prep SDfile
Find this compound or compounds like it in BindingDB:
Activity Spreadsheet -- Enzyme Inhibition Constant Data from BindingDB
Found 1 hit for monomerid = 50000457
Target5-hydroxytryptamine receptor 3A/3B(Rattus norvegicus)
Syntex Research
Curated by ChEMBL
LigandPNGBDBM50000457(CHEMBL542904)
Affinity DataKi:  0.200nM. Assay description: Binding affinity against 5-hydroxytryptamine 3 (5-HT3) receptor in rat brain cortical membranes using radioligand [3H]quipazineChecked by Author
In DepthDetails ArticlePubMed