BDBM50000469 CHEMBL542903
SMILES Cl.O=c1n(cc2CCCCc3cccc1c23)[C@@H]1CN2CCC1CC2
InChI Key InChIKey=RNXKNESUQBZUTB-GMUIIQOCSA-N
Data  1 KI
  Tab Delimited (TSV)   2D SDfile   Computed 3D by Vconf -m prep SDfile
Find this compound or compounds like it in BindingDB:
Activity Spreadsheet -- Enzyme Inhibition Constant Data from BindingDB
Found 1 hit for monomerid = 50000469
Target5-hydroxytryptamine receptor 3A/3B(Rattus norvegicus)
Syntex Research
Curated by ChEMBL
LigandPNGBDBM50000469(CHEMBL542903)
Affinity DataKi:  0.400nM. Assay description: Binding affinity against 5-hydroxytryptamine 3 (5-HT3) receptor in rat brain cortical membranes using radioligand [3H]quipazineChecked by Author
In DepthDetails ArticlePubMed