BDBM50000480 2-(5-chlorospiro[2,3-dihydrobenzo[b]furan-2,1'-cyclohexane]-6-ylcarboxamido)-4-azabicyclo[2.2.2]octane::CHEMBL171867
SMILES Clc1cc2CC3(CCCCC3)Oc2c(c1)C(=O)NC1CN2CCC1CC2
InChI Key InChIKey=AERMVUPJHDNYRW-UHFFFAOYSA-N
Data  1 KI
  Tab Delimited (TSV)   2D SDfile   Computed 3D by Vconf -m prep SDfile
Find this compound or compounds like it in BindingDB:
Activity Spreadsheet -- Enzyme Inhibition Constant Data from BindingDB
Found 1 hit for monomerid = 50000480
Target5-hydroxytryptamine receptor 3A/3B(Rattus norvegicus)
Rh£Ne-Poulenc Rorer Central Research
Curated by ChEMBL
LigandPNGBDBM50000480(2-(5-chlorospiro[2,3-dihydrobenzo[b]furan-2,1'-cyc...)
Affinity DataKi:  1.10nM. Assay description: Displacement of the 5-hydroxytryptamine 3 receptor ligand [3H]GR-65630 from rat brain cortical membranes.
In DepthDetails ArticlePubMed