BDBM50000502 4-Morpholin-2-yl-benzene-1,2-diol::CHEMBL7681
SMILES Oc1ccc(cc1O)C1CNCCO1
InChI Key InChIKey=GYJRRQRGZZEHEB-UHFFFAOYSA-N
Data  4 KI
  Tab Delimited (TSV)   2D SDfile   Computed 3D by Vconf -m prep SDfile
Find this compound or compounds like it in BindingDB:
Activity Spreadsheet -- Enzyme Inhibition Constant Data from BindingDB
Found 4 hits for monomerid = 50000502
LigandPNGBDBM50000502(4-Morpholin-2-yl-benzene-1,2-diol | CHEMBL7681)
Affinity DataKi:  26nM. Assay description: Compound was evaluated for alpha adrenergic binding affinity towards Alpha-2 adrenergic receptor of rat brain
In DepthDetails ArticlePubMed
TargetAlpha-1A/Alpha-1B/Alpha-1D adrenergic receptor(Rattus norvegicus (rat))
Universit£
Curated by ChEMBL
LigandPNGBDBM50000502(4-Morpholin-2-yl-benzene-1,2-diol | CHEMBL7681)
Affinity DataKi:  7.40E+3nM. Assay description: Binding affinity towards Alpha-1 adrenergic receptor of rat brain
In DepthDetails ArticlePubMed
TargetBeta-2 adrenergic receptor(BOVINE)
Universit£
Curated by ChEMBL
LigandPNGBDBM50000502(4-Morpholin-2-yl-benzene-1,2-diol | CHEMBL7681)
Affinity DataKi:  9.20E+3nM. Assay description: Compound was evaluated for beta adrenergic binding affinity towards beta-2 receptor of bovine lung
In DepthDetails ArticlePubMed
TargetBeta-1 adrenergic receptor(Rattus norvegicus (Rat))
Universit£
Curated by ChEMBL
LigandPNGBDBM50000502(4-Morpholin-2-yl-benzene-1,2-diol | CHEMBL7681)
Affinity DataKi:  1.50E+4nM. Assay description: Compound was evaluated for beta adrenergic binding affinity towards beta-1 receptor of rat brain
In DepthDetails ArticlePubMed