BDBM50000517 3-{2-[2-(2-{2-[2-Amino-3-(4-hydroxy-phenyl)-propionylamino]-4-methylsulfanyl-butyrylamino}-3-phenyl-propionylamino)-4-methyl-pentanoylamino]-4-methylsulfanyl-butyrylamino}-succinamic acid::CHEMBL435762
SMILES CSCC[C@@H](NC(=O)[C@@H](N)Cc1ccc(O)cc1)C(=O)N[C@@H](Cc1ccccc1)C(=O)N[C@@H](CC(C)C)C(=O)N[C@H](CCSC)C(=O)N[C@@H](CC(O)=O)C(N)=O
InChI Key InChIKey=JRLZOSJEGCSPDI-CKGIDNKHSA-N
Data  2 KI
  Tab Delimited (TSV)   2D SDfile   Computed 3D by Vconf -m prep SDfile
Find this compound or compounds like it in BindingDB:
Activity Spreadsheet -- Enzyme Inhibition Constant Data from BindingDB
Found 2 hits for monomerid = 50000517
TargetDelta-type opioid receptor(Rattus norvegicus (rat))
National Institute Of Environmental Health Sciences
Curated by ChEMBL
LigandPNGBDBM50000517(3-{2-[2-(2-{2-[2-Amino-3-(4-hydroxy-phenyl)-propio...)
Affinity DataKi:  26nM. Assay description: Inhibition of [3H]-DPDPE binding to Opioid receptor delta 1
In DepthDetails ArticlePubMed
TargetMu-type opioid receptor(Rattus norvegicus (rat))
National Institute Of Environmental Health Sciences
Curated by ChEMBL
LigandPNGBDBM50000517(3-{2-[2-(2-{2-[2-Amino-3-(4-hydroxy-phenyl)-propio...)
Affinity DataKi:  407nM. Assay description: Inhibition of [3H]-DAGO binding to rat Opioid receptor mu 1
In DepthDetails ArticlePubMed