BDBM50000702 7-[4-(4-Fluoro-phenyl)-1-methyl-butyl]-5-methoxy-10,10-dimethyl-3-pyridin-2-ylmethyl-2,3,4,10-tetrahydro-1H-9-oxa-3-aza-phenanthrene::CHEMBL65556
SMILES COc1cc(cc2OC(C)(C)C3=C(CN(Cc4ccccn4)CC3)c12)C(C)CCCc1ccc(F)cc1
InChI Key InChIKey=LOXUUVJTKHHJKI-UHFFFAOYSA-N
Data  1 KI
  Tab Delimited (TSV)   2D SDfile   Computed 3D by Vconf -m prep SDfile
Find this compound or compounds like it in BindingDB:
Activity Spreadsheet -- Enzyme Inhibition Constant Data from BindingDB
Found 1 hit for monomerid = 50000702
TargetPlatelet-activating factor receptor(Cavia porcellus)
Abbott Laboratories
Curated by ChEMBL
LigandPNGBDBM50000702(7-[4-(4-Fluoro-phenyl)-1-methyl-butyl]-5-methoxy-1...)
Affinity DataKi:  4.21E+3nM. Assay description: In vitro intrinsic binding affinity at platelet activating factor receptor using rabbit platelet membranes
In DepthDetails ArticlePubMed