BDBM50000742 CHEMBL2369452::[His-Arg-Leu-Ala-Gly-Leu-Leu-Ser-Arg-Ser-Gly-Gly-Val-Val-Lys-Asn-Asn-Phe-Val-Pro-Thr-Asn-Val-Gly-Ser-Lys-Ala-Phe-NH2] hCG
SMILES CC(C)C[C@H](NC(=O)CNC(=O)[C@H](C)NC(=O)[C@H](CC(C)C)NC(=O)[C@H](CCCN=C(N)N)NC(=O)[C@@H](N)Cc1c[nH]cn1)C(=O)N[C@@H](CC(C)C)C(=O)N[C@@H](CO)C(=O)N[C@@H](CCCN=C(N)N)C(=O)N[C@@H](CO)C(=O)NCC(=O)NCC(=O)N[C@@H](C(C)C)C(=O)N[C@@H](C(C)C)C(=O)N[C@@H](CCCCN)C(=O)N[C@@H](CC(N)=O)C(=O)N[C@@H](CC(N)=O)C(=O)N[C@@H](Cc1ccccc1)C(=O)N[C@@H](C(C)C)C(=O)N1CCC[C@H]1C(=O)N[C@@H]([C@@H](C)O)C(=O)N[C@@H](CC(N)=O)C(=O)N[C@@H](C(C)C)C(=O)NCC(=O)N[C@@H](CO)C(=O)N[C@@H](CCCCN)C(=O)N[C@@H](C)C(=O)N[C@@H](Cc1ccccc1)C(N)=O
InChI Key InChIKey=GCNXVNQFRGRXPR-SNDKDGQYSA-N
Data  3 IC50
  Tab Delimited (TSV)   2D SDfile   Computed 3D by Vconf -m prep SDfile
Find this compound or compounds like it in BindingDB:
Activity Spreadsheet -- Enzyme Inhibition Constant Data from BindingDB
Found 3 hits for monomerid = 50000742
TargetCalcitonin gene-related peptide type 1 receptor(Rattus norvegicus)
Université
Curated by ChEMBL
LigandPNGBDBM50000742(CHEMBL2369452 | [His-Arg-Leu-Ala-Gly-Leu-Leu-Ser-A...)
Affinity DataIC50:  9nM. Assay description: Binding affinity against [125I]-hCalcitonin gene-related peptide type alpha receptor binding sites in rat brain membrane
In DepthDetails ArticlePubMed
TargetCalcitonin gene-related peptide type 1 receptor(Homo sapiens (Human))
Université
Curated by ChEMBL
LigandPNGBDBM50000742(CHEMBL2369452 | [His-Arg-Leu-Ala-Gly-Leu-Leu-Ser-A...)
Affinity DataIC50:  9nM. Assay description: Binding affinity against [125I]-hCalcitonin gene-related peptide type receptor binding sites in guinea pig atrium membrane
In DepthDetails ArticlePubMed
TargetCalcitonin gene-related peptide type 1 receptor(Homo sapiens (Human))
Université
Curated by ChEMBL
LigandPNGBDBM50000742(CHEMBL2369452 | [His-Arg-Leu-Ala-Gly-Leu-Leu-Ser-A...)
Affinity DataIC50:  9nM. Assay description: Binding affinity of the compound against [125I]-hCalcitonin gene-related peptide type receptor binding sites in guinea pig vas deferens membrane prep...
In DepthDetails ArticlePubMed