BDBM50000825 3-Methoxy-3-[3-(naphthalen-2-ylmethoxy)-phenyl]-tetrahydro-furan (0.1 hydrate)::CHEMBL87722
SMILES COC1(CCOC1)c1cccc(OCc2ccc3ccccc3c2)c1
InChI Key InChIKey=WBAUXCCKCMCCPO-UHFFFAOYSA-N
Data  1 IC50
  Tab Delimited (TSV)   2D SDfile   Computed 3D by Vconf -m prep SDfile
Find this compound or compounds like it in BindingDB:
Activity Spreadsheet -- Enzyme Inhibition Constant Data from BindingDB
Found 1 hit for monomerid = 50000825
TargetPolyunsaturated fatty acid 5-lipoxygenase(Homo sapiens (Human))
Ici Pharmaceuticals Group
Curated by ChEMBL
LigandPNGBDBM50000825(3-Methoxy-3-[3-(naphthalen-2-ylmethoxy)-phenyl]-te...)
Affinity DataIC50:  700nM. Assay description: In vitro inhibition of leukotriene B4 synthesis in human whole blood by inhibiting 5-lipoxygenase
In DepthDetails ArticlePubMed