BDBM50000834 3-[3-Fluoro-5-(4-methoxy-tetrahydro-pyran-4-yl)-phenoxymethyl]-1H-quinolin-2-one; compound with acetic acid ethyl ester::CHEMBL89603
SMILES COC1(CCOCC1)c1cc(F)cc(OCc2cc3ccccc3[nH]c2=O)c1
InChI Key InChIKey=UTBAFSLOUGSPFF-UHFFFAOYSA-N
Data  1 IC50
  Tab Delimited (TSV)   2D SDfile   Computed 3D by Vconf -m prep SDfile
Find this compound or compounds like it in BindingDB:
Activity Spreadsheet -- Enzyme Inhibition Constant Data from BindingDB
Found 1 hit for monomerid = 50000834
TargetPolyunsaturated fatty acid 5-lipoxygenase(Homo sapiens (Human))
Ici Pharmaceuticals Group
Curated by ChEMBL
LigandPNGBDBM50000834(3-[3-Fluoro-5-(4-methoxy-tetrahydro-pyran-4-yl)-ph...)
Affinity DataIC50:  200nM. Assay description: In vitro inhibition of leukotriene B4 synthesis in human whole blood by inhibiting 5-lipoxygenase
In DepthDetails ArticlePubMed