BDBM50000939 1-[4-(2-Oxo-2,3-dihydro-1H-imidazo[4,5-b]quinolin-7-yloxy)-butyryl]-piperidine-4-carboxylic acid::CHEMBL91570
SMILES OC(=O)C1CCN(CC1)C(=O)CCCOc1ccc2nc3[nH]c(=O)[nH]c3cc2c1
InChI Key InChIKey=RDHLJUVEBZYGBB-UHFFFAOYSA-N
Data  1 IC50  2 EC50
  Tab Delimited (TSV)   2D SDfile   Computed 3D by Vconf -m prep SDfile
Find this compound or compounds like it in BindingDB:
Activity Spreadsheet -- Enzyme Inhibition Constant Data from BindingDB
Found 3 hits for monomerid = 50000939
TargetcGMP-inhibited 3',5'-cyclic phosphodiesterase 3A/3B(Homo sapiens (Human))
Bristol-Myers Squibb Pharmaceutical Research Institute
Curated by ChEMBL
LigandPNGBDBM50000939(1-[4-(2-Oxo-2,3-dihydro-1H-imidazo[4,5-b]quinolin-...)
Affinity DataIC50:  20nM. Assay description: Inhibition of platelet aggregation using Adenosine diphosphate (ADP) as activating agent in rabbit platelet rich plasma (PRP)
In DepthDetails ArticlePubMed
TargetP2Y purinoceptor 12(Homo sapiens (Human))
Bristol-Myers Squibb Pharmaceutical Research Institute
Curated by ChEMBL
LigandPNGBDBM50000939(1-[4-(2-Oxo-2,3-dihydro-1H-imidazo[4,5-b]quinolin-...)
Affinity DataEC50:  380nM. Assay description: Inhibition of platelet aggregation using Adenosine diphosphate (ADP) as activating agent in rabbit platelet rich plasma (PRP)
In DepthDetails ArticlePubMed
TargetP2Y purinoceptor 12(Homo sapiens (Human))
Bristol-Myers Squibb Pharmaceutical Research Institute
Curated by ChEMBL
LigandPNGBDBM50000939(1-[4-(2-Oxo-2,3-dihydro-1H-imidazo[4,5-b]quinolin-...)
Affinity DataEC50:  4.53E+4nM. Assay description: Inhibition of platelet aggregation using adenosine diphosphate (ADP) as activating agent in human platelet rich plasma (PRP)
In DepthDetails ArticlePubMed