BDBM50001006 (10-(p-tolylsulfonyl)hydrazone)-Aranciamycin::CHEMBL94382
SMILES COC1C(O[C@H]2[C@H](OC)[C@](C)(O)C(=NNS(=O)(=O)c3ccc(C)cc3)c3cc4C(=O)c5cccc(O)c5C(=O)c4c(O)c23)OC(C)C(O)C1O
InChI Key InChIKey=STMKLHOHNFIXFF-ZFYKEJBMSA-N
Data  1 IC50
  Tab Delimited (TSV)   2D SDfile   Computed 3D by Vconf -m prep SDfile
Find this compound or compounds like it in BindingDB:
Activity Spreadsheet -- Enzyme Inhibition Constant Data from BindingDB
Found 1 hit for monomerid = 50001006
Target72 kDa type IV collagenase(Homo sapiens (Human))
Technical University Of Denmark
Curated by ChEMBL
LigandPNGBDBM50001006((10-(p-tolylsulfonyl)hydrazone)-Aranciamycin | CHE...)
Affinity DataIC50:  420nM. Assay description: Inhibitory concentration against Clostridium histolyticum Collagenase
In DepthDetails ArticlePubMed