BDBM50001039 6,11-Dimethyl-3-(1-methyl-allyl)-1,2,3,4,5,6-hexahydro-2,6-methano-benzo[d]azocin-8-ol::CHEMBL2367796
SMILES [H][C@](C)(C=C)N1CC[C@@]2(C)[C@@H](C)[C@@]1([H])Cc1ccc(O)cc21
InChI Key InChIKey=UKEVPQXYIJDXEL-UHIXZJCNSA-N
Data  1 KI
  Tab Delimited (TSV)   2D SDfile   Computed 3D by Vconf -m prep SDfile
Find this compound or compounds like it in BindingDB:
Activity Spreadsheet -- Enzyme Inhibition Constant Data from BindingDB
Found 1 hit for monomerid = 50001039
TargetMu-type opioid receptor(Rattus norvegicus (rat))
Research Triangle Institute
Curated by ChEMBL
LigandPNGBDBM50001039(6,11-Dimethyl-3-(1-methyl-allyl)-1,2,3,4,5,6-hexah...)
Affinity DataKi:  3nM. Assay description: Binding affinity against opioid receptor mu using [3H]-DAMGO as radioligand.
In DepthDetails ArticlePubMed