BDBM50001174 2-(Benzothiazol-2-ylsulfanyl)-ethylamine-N-hydroxy carboxamide::CHEMBL320275
SMILES ONC(=O)NCCSc1nc2ccccc2s1
InChI Key InChIKey=RDBKEUQZCJZWKI-UHFFFAOYSA-N
Data  1 EC50
  Tab Delimited (TSV)   2D SDfile   Computed 3D by Vconf -m prep SDfile
Find this compound or compounds like it in BindingDB:
Activity Spreadsheet -- Enzyme Inhibition Constant Data from BindingDB
Found 1 hit for monomerid = 50001174
TargetPolyunsaturated fatty acid 5-lipoxygenase(Homo sapiens (Human))
R. W. Johnson Pharmaceutical Research Institute
Curated by ChEMBL
LigandPNGBDBM50001174(2-(Benzothiazol-2-ylsulfanyl)-ethylamine-N-hydroxy...)
Affinity DataEC50:  5.20E+3nM. Assay description: In vitro inhibition of ionophore stimulated LTB4 release from human peripheral blood leukocytes.
In DepthDetails ArticlePubMed